Reaction Details
TargetLysophosphatidic acid receptor 1
LigandBDBM223529
Substrate/Competitorn/a
Meas. Tech.Calcium Flux Assay Using Fluorometric Imaging Plate Reader (FLIPR) Assay
Temperature298.15±n/a K
IC50 21910±n/a nM
Commentsextracted
Citation Gabriel, SDHamilton, MMLucas, MCQian, YSidduri, A N-alkyltriazole compounds as LPAR antagonists US Patent US9321738 Publication Date 4/26/2016
 
Lysophosphatidic acid receptor 1
Name:Lysophosphatidic acid receptor 1
Type:Enzyme
Mol. Mass.:41120.55
Organism:Homo sapiens (Human)
Description:Q92633
Residue:364
BDBM223529
NameBDBM223529
Synonyms:US9321738, 1
TypeSmall organic molecule
Emp. Form.C19H18BrN3O2
Mol. Mass.400.269
SMILESC[C@@H](OC(=O)Cc1c(nnn1C)-c1ccc(Br)cc1)c1ccccc1