Reaction Details
TargetLysophosphatidic acid receptor 1
LigandBDBM223532
Substrate/Competitorn/a
Meas. Tech.Calcium Flux Assay Using Fluorometric Imaging Plate Reader (FLIPR) Assay
Temperature298.15±n/a K
IC50 4450±n/a nM
Commentsextracted
Citation Gabriel, SDHamilton, MMLucas, MCQian, YSidduri, A N-alkyltriazole compounds as LPAR antagonists US Patent US9321738 Publication Date 4/26/2016
 
Lysophosphatidic acid receptor 1
Name:Lysophosphatidic acid receptor 1
Type:Enzyme
Mol. Mass.:41120.55
Organism:Homo sapiens (Human)
Description:Q92633
Residue:364
BDBM223532
NameBDBM223532
Synonyms:US9321738, 9
TypeSmall organic molecule
Emp. Form.C28H26N4O4
Mol. Mass.482.5304
SMILESC[C@@H](OC(=O)Nc1c(nnn1C)-c1ccc(cc1)-c1cccc(c1)C1(CC1)C(O)=O)c1ccccc1