Reaction Details
TargetLysophosphatidic acid receptor 1
LigandBDBM223533
Substrate/Competitorn/a
Meas. Tech.Calcium Flux Assay Using Fluorometric Imaging Plate Reader (FLIPR) Assay
Temperature298.15±n/a K
IC50>30000±n/a nM
Commentsextracted
Citation Gabriel, SDHamilton, MMLucas, MCQian, YSidduri, A N-alkyltriazole compounds as LPAR antagonists US Patent US9321738 Publication Date 4/26/2016
 
Lysophosphatidic acid receptor 1
Name:Lysophosphatidic acid receptor 1
Type:Enzyme
Mol. Mass.:41120.55
Organism:Homo sapiens (Human)
Description:Q92633
Residue:364
BDBM223533
NameBDBM223533
Synonyms:US9321738, 10
TypeSmall organic molecule
Emp. Form.C29H27FN4O4
Mol. Mass.514.5475
SMILESCOC(=O)C1(CC1)c1ccc(cc1)-c1ccc(-c2nnn(C)c2NC(=O)O[C@H](C)c2ccccc2)c(F)c1