Reaction Details
TargetLysophosphatidic acid receptor 1
LigandBDBM50398089
Substrate/Competitorn/a
Meas. Tech.Calcium Flux Assay Using Fluorometric Imaging Plate Reader (FLIPR) Assay
Temperature298.15±n/a K
IC50 58±n/a nM
Commentsextracted
Citation Gabriel, SDHamilton, MMLucas, MCQian, YSidduri, A N-alkyltriazole compounds as LPAR antagonists US Patent US9321738 Publication Date 4/26/2016
 
Lysophosphatidic acid receptor 1
Name:Lysophosphatidic acid receptor 1
Type:Enzyme
Mol. Mass.:41120.55
Organism:Homo sapiens (Human)
Description:Q92633
Residue:364
BDBM50398089
NameBDBM50398089
Synonyms:CHEMBL2182051 | US9321738, 14
TypeSmall organic molecule
Emp. Form.C26H30N4O4
Mol. Mass.462.5408
SMILESC[C@@H](OC(=O)Nc1c(nnn1C)-c1ccc(cc1)C1CCC(CC(O)=O)CC1)c1ccccc1