Reaction Details
TargetLysophosphatidic acid receptor 3
LigandBDBM223531
Substrate/Competitorn/a
Meas. Tech.Calcium Flux Assay Using Fluorometric Imaging Plate Reader (FLIPR) Assay
Temperature298.15±n/a K
IC50>30000±n/a nM
Commentsextracted
Citation Gabriel, SDHamilton, MMLucas, MCQian, YSidduri, A N-alkyltriazole compounds as LPAR antagonists US Patent US9321738 Publication Date 4/26/2016
 
Lysophosphatidic acid receptor 3
Name:Lysophosphatidic acid receptor 3
Type:Enzyme
Mol. Mass.:40149.72
Organism:Homo sapiens (Human)
Description:Q9UBY5
Residue:353
BDBM223531
NameBDBM223531
Synonyms:US9321738, 8
TypeSmall organic molecule
Emp. Form.C28H26N4O4
Mol. Mass.482.5304
SMILESC[C@@H](OC(=O)Nc1nnn(C)c1-c1ccc(cc1)-c1ccc(cc1)C1(CC1)C(O)=O)c1ccccc1