Reaction Details
TargetLysophosphatidic acid receptor 3
LigandBDBM50398091
Substrate/Competitorn/a
Meas. Tech.Calcium Flux Assay Using Fluorometric Imaging Plate Reader (FLIPR) Assay
Temperature298.15±n/a K
IC50 2310±n/a nM
Commentsextracted
Citation Gabriel, SDHamilton, MMLucas, MCQian, YSidduri, A N-alkyltriazole compounds as LPAR antagonists US Patent US9321738 Publication Date 4/26/2016
 
Lysophosphatidic acid receptor 3
Name:Lysophosphatidic acid receptor 3
Type:Enzyme
Mol. Mass.:40149.72
Organism:Homo sapiens (Human)
Description:Q9UBY5
Residue:353
BDBM50398091
NameBDBM50398091
Synonyms:CHEMBL2182049 | US9321738, 12
TypeSmall organic molecule
Emp. Form.C29H29N5O5S
Mol. Mass.559.636
SMILESC[C@@H](OC(=O)Nc1c(nnn1C)-c1ccc(cc1)-c1ccc(cc1)C1(CC1)C(=O)NS(C)(=O)=O)c1ccccc1