Reaction Details
TargetBeta-secretase 2
LigandBDBM291143
Substrate/Competitorn/a
Meas. Tech.BACE-2 Assay
pH5±n/a
Ki 16.0±n/a nM
Commentsextracted
Citation Cumming, JNScott, Jr., JDStamford, AWIserloh, UNeelamkavil, SFShao, PPWilson, JE C6-spiro iminothiadiazine dioxides as BACE inhibitors, compositions, and their use US Patent US9580396 Publication Date 2/28/2017
 
Beta-secretase 2
Name:Beta-secretase 2
Type:Protein
Mol. Mass.:56171.20
Organism:Homo sapiens (Human)
Description:Q9Y5Z0
Residue:518
BDBM291143
NameBDBM291143
Synonyms:US9580396, Example 5f
TypeSmall organic molecule
Emp. Form.C17H20N6O4S
Mol. Mass.404.444
SMILESCN1C(=N)N[C@@]2(CCCc3ccc(NC(=O)c4noc(C)n4)cc23)CS1(=O)=O