Reaction Details
TargetAlpha-glucosidase MAL32
LigandBDBM225286
Substrate/Competitorn/a
Meas. Tech.In Vitro α-Glucosidase Inhibitory Assay
pH6.8±0
Temperature310.15±0 K
IC50 7.92e+3± 1.7e+2 nM
Citation Wang, GWang, JXie, ZChen, MLi, LPeng, YChen, SLi, WDeng, B Discovery of 3,3-di(indolyl)indolin-2-one as a novel scaffold for a-glucosidase inhibitors: In silico studies and SAR predictions Bioorg Chem72:228-233 (2017)  
 
Alpha-glucosidase MAL32
Name:Alpha-glucosidase MAL32
Type:Hydrolase
Mol. Mass.:68132.36
Organism:Saccharomyces cerevisiae
Description:Purchased from Wako Fine Chemicals Co. Ltd.
Residue:584
BDBM225286
NameBDBM225286
Synonyms:1,1''-bis(3-Fluorobenzyl)-1H,1''H-[3,3':3',3''-terindol]-2'(1'H)-one (4g)
TypeSmall organic molecule
Emp. Form.C38H27F2N3O
Mol. Mass.579.6373
SMILESFc1cccc(Cn2cc(c3ccccc23)C2(C(=O)Nc3ccccc23)c2cn(Cc3cccc(F)c3)c3ccccc23)c1