Reaction Details
TargetUrokinase-type plasminogen activator [179-424,C299A,N323Q]
LigandBDBM50138663
Substrate/Competitorn/a
Meas. Tech.Photometric_Method1
Ki 5910±n/a nM
Citation D3R, DD Abbott Urokinase D3R D3R Publication Date 6/30/2015
 
Urokinase-type plasminogen activator [179-424,C299A,N323Q]
Name:Urokinase-type plasminogen activator [179-424,C299A,N323Q]
Type:n/a
Mol. Mass.:27687.84
Organism:Homo sapiens (Human)
Description:P00749[179-424,C299A,N323Q]
Residue:246
BDBM50138663
NameBDBM50138663
Synonyms:2-naphthimidamide Naphthalene-2-carboxamidine uPa_6
TypeSmall organic molecule
Emp. Form.C11H10N2
Mol. Mass.170.2105
SMILESNC(=N)c1ccc2ccccc2c1