Reaction Details
TargetTyrosine-protein kinase SYK [360-635]
LigandBDBM227521
Substrate/Competitorn/a
Meas. Tech.SYK Kinase Assay
Temperature303.15±n/a K
IC50 16.3±n/a nM
Commentsextracted
Citation Hermann, JCKennedy-Smith, JLucas, MCPadilla, FSchoenfeld, RCWovkulich, PM Pyrrolo[2,3-B]pyrazines as SYK inhibitors US Patent US9334278 Publication Date 5/10/2016
 
Tyrosine-protein kinase SYK [360-635]
Name:Tyrosine-protein kinase SYK [360-635]
Type:n/a
Mol. Mass.:31987.15
Organism:Homo sapiens (Human)
Description:Human MetAP2 protein from a culture superatant of insect cells (sf9) infected with MetAP2 recombinant baculovirus
Residue:276
BDBM227521
NameBDBM227521
Synonyms:US9334278, I-10
TypeSmall organic molecule
Emp. Form.C16H18N6O
Mol. Mass.310.3537
SMILESCC(C)(C)NC(=O)c1c[nH]c2ncc(Nc3cccnc3)nc12