Reaction Details
TargetOxidized purine nucleoside triphosphate hydrolase
LigandBDBM227631
Substrate/CompetitorBDBM227639
Meas. Tech.In Vitro MTH1 Enzymatic Assay
pH7.5±n/a
IC50 2.8e+3± 2e+2 nM
Commentsextracted
Citation Kumar, AKawamura, TKawatani, MOsada, HZhang, KYJ Identification and structure-activity relationship of purine derivatives as novel MTH1 inhibitors. Chem Biol Drug Des89:862-869 (2017) 
 
Oxidized purine nucleoside triphosphate hydrolase
Name:Oxidized purine nucleoside triphosphate hydrolase
Type:Protein
Mol. Mass.:22514.81
Organism:Homo sapiens (Human)
Description:P36639
Residue:156
BDBM227631
BDBM227639
NameBDBM227631
Synonyms:MTH1 inhibitor, 14
TypeSmall organic molecule
Emp. Form.C13H13N5
Mol. Mass.239.2758
SMILESC(Cc1ccccc1)Nc1ncnc2[nH]cnc12