Reaction Details
TargetOxidized purine nucleoside triphosphate hydrolase
LigandBDBM227634
Substrate/CompetitorBDBM227639
Meas. Tech.In Vitro MTH1 Enzymatic Assay
pH7.5±n/a
IC50 2.1e+2± 3e+1 nM
Commentsextracted
Citation Kumar, AKawamura, TKawatani, MOsada, HZhang, KYJ Identification and structure-activity relationship of purine derivatives as novel MTH1 inhibitors. Chem Biol Drug Des89:862-869 (2017) 
 
Oxidized purine nucleoside triphosphate hydrolase
Name:Oxidized purine nucleoside triphosphate hydrolase
Type:Protein
Mol. Mass.:22514.81
Organism:Homo sapiens (Human)
Description:P36639
Residue:156
BDBM227634
BDBM227639
NameBDBM227634
Synonyms:MTH1 inhibitor, 121
TypeSmall organic molecule
Emp. Form.C15H18N6O2
Mol. Mass.314.3424
SMILESCOc1ccc(CCNc2nc(N)nc3[nH]cnc23)cc1OC