Reaction Details
TargetOxidized purine nucleoside triphosphate hydrolase
LigandBDBM227637
Substrate/CompetitorBDBM227639
Meas. Tech.In Vitro MTH1 Enzymatic Assay
pH7.5±n/a
IC50 1.4e+4± 2e+3 nM
Commentsextracted
Citation Kumar, AKawamura, TKawatani, MOsada, HZhang, KYJ Identification and structure-activity relationship of purine derivatives as novel MTH1 inhibitors. Chem Biol Drug Des89:862-869 (2017) 
 
Oxidized purine nucleoside triphosphate hydrolase
Name:Oxidized purine nucleoside triphosphate hydrolase
Type:Protein
Mol. Mass.:22514.81
Organism:Homo sapiens (Human)
Description:P36639
Residue:156
BDBM227637
BDBM227639
NameBDBM227637
Synonyms:MTH1 inhibitor, 131
TypeSmall organic molecule
Emp. Form.C10H13N5O
Mol. Mass.219.2431
SMILESC\C(CO)=C/CNc1ncnc2[nH]cnc12