Reaction Details
TargetOxidized purine nucleoside triphosphate hydrolase
LigandBDBM227635
Substrate/CompetitorBDBM227640
Meas. Tech.In Vitro MTH1 Enzymatic Assay
pH7.5±n/a
IC50 9.1e+3± 4.3e+3 nM
Commentsextracted
Citation Kumar, AKawamura, TKawatani, MOsada, HZhang, KYJ Identification and structure-activity relationship of purine derivatives as novel MTH1 inhibitors. Chem Biol Drug Des89:862-869 (2017) 
 
Oxidized purine nucleoside triphosphate hydrolase
Name:Oxidized purine nucleoside triphosphate hydrolase
Type:Protein
Mol. Mass.:22514.81
Organism:Homo sapiens (Human)
Description:P36639
Residue:156
BDBM227635
BDBM227640
NameBDBM227635
Synonyms:MTH1 inhibitor, 122
TypeSmall organic molecule
Emp. Form.C8H12N6O
Mol. Mass.208.2205
SMILESCOCCNc1nc(N)nc2[nH]cnc12