Reaction Details
TargetATP-dependent translocase ABCB1 bd-vinblastine
LigandBDBM227643
Substrate/Competitorn/a
Meas. Tech.Fluorescence Correlation Spectroscopy (FCS)
Temperature295.65±0.5 K
IC50 8.8e+3± 6e+3 nM
Citation Li, MJNath, AAtkins, WM Differential Coupling of Binding, ATP Hydrolysis, and Transport of Fluorescent Probes with P-Glycoprotein in Lipid Nanodiscs. Biochemistry56:2506-2517 (2017) 
 
ATP-dependent translocase ABCB1 bd-vinblastine
Name:ATP-dependent translocase ABCB1 bd-vinblastine
Synonyms:n/a
Type:Protein
Mol. Mass.:n/a
Description:n/a
Components:This complex has 2 components.
Component 1
Name:ATP-dependent translocase ABCB1
Type:Protein
Mol. Mass.:140669.02
Organism:Mus musculus (Mouse)
Description:P21447
Residue:1276
Component 2
NameBDBM227642
Synonyms:BD-vinblastine | BODIPY-vinblastine
TypeSmall organic molecule
Emp. Form.C58H71BF2N6O9
Mol. Mass.1045.027
SMILESCC[C@]1(O)CC2CN(C1)CCc1c3C=CCCc3[nH]c1[C@@](C2)(C(=O)OC)c1cc2c(cc1OC)N(C)[C@@H]1[C@]22CCN3CC=C[C@](CC)([C@@H]23)C(OC(=O)CCC2=[N+]3C(C=C2)=Cc2c(C)cc(C)n2[B-]3(F)F)[C@]1(O)C(=O)OC
BDBM227643
NameBDBM227643
Synonyms:Vinblastine
TypeSmall organic molecule
Emp. Form.C46H58N4O9
Mol. Mass.810.9741
SMILESCC[C@]1(O)C[C@H]2CN(C1)CCc1c([nH]c3ccccc13)[C@@](C2)(C(=O)OC)c1cc2c(cc1OC)N(C)[C@@H]1[C@]22CCN3CC=C[C@](CC)([C@@H]23)[C@@H](OC(C)=O)[C@]1(O)C(=O)OC