Reaction Details
TargetBone morphogenetic protein receptor type-1A
LigandBDBM143311
Substrate/Competitorn/a
Meas. Tech.ALK1-6 enzymatic assays
pH7.5±n/a
IC50 92±n/a nM
Commentsextracted
Citation Alimardanov, ACuny, GDGrewal, GSLee, AMcKew, JCMohedas, AHShen, MXu, XYu, PB BMP inhibitors and methods of use thereof US Patent US9682983 Publication Date 6/20/2017
 
Bone morphogenetic protein receptor type-1A
Name:Bone morphogenetic protein receptor type-1A
Type:Enzyme
Mol. Mass.:60204.46
Organism:Homo sapiens (Human)
Description:P36894
Residue:532
BDBM143311
NameBDBM143311
Synonyms:US10017516, Compound 11 | US9682983, 11
TypeSmall organic molecule
Emp. Form.C28H28N6
Mol. Mass.448.5621
SMILESC[C@H]1CNC[C@@H](C)N1c1ccc(cc1)-c1cnc2c(cnn2c1)-c1cc(C)nc2ccccc12