Reaction Details
TargetBone morphogenetic protein receptor type-1B
LigandBDBM143566
Substrate/Competitorn/a
Meas. Tech.ALK1-6 enzymatic assays
pH7.5±n/a
IC50 51±n/a nM
Commentsextracted
Citation Alimardanov, ACuny, GDGrewal, GSLee, AMcKew, JCMohedas, AHShen, MXu, XYu, PB BMP inhibitors and methods of use thereof US Patent US9682983 Publication Date 6/20/2017
 
Bone morphogenetic protein receptor type-1B
Name:Bone morphogenetic protein receptor type-1B
Type:Enzyme
Mol. Mass.:56939.41
Organism:Homo sapiens (Human)
Description:O00238
Residue:502
BDBM143566
NameBDBM143566
Synonyms:US10017516, Compound 13 | US9682983, 13
TypeSmall organic molecule
Emp. Form.C27H25N5
Mol. Mass.419.5209
SMILESCc1cc(-c2cnn3cc(cnc23)-c2ccc(cc2)C2CCNCC2)c2ccccc2n1