Reaction Details
TargetBone morphogenetic protein receptor type-1B
LigandBDBM148370
Substrate/Competitorn/a
Meas. Tech.ALK1-6 enzymatic assays
pH7.5±n/a
IC50 2192±n/a nM
Commentsextracted
Citation Alimardanov, ACuny, GDGrewal, GSLee, AMcKew, JCMohedas, AHShen, MXu, XYu, PB BMP inhibitors and methods of use thereof US Patent US9682983 Publication Date 6/20/2017
 
Bone morphogenetic protein receptor type-1B
Name:Bone morphogenetic protein receptor type-1B
Type:Enzyme
Mol. Mass.:56939.41
Organism:Homo sapiens (Human)
Description:O00238
Residue:502
BDBM148370
NameBDBM148370
Synonyms:US10017516, Compound 31 | US9682983, 31
TypeSmall organic molecule
Emp. Form.C28H27N5O
Mol. Mass.449.5469
SMILESC(CN1CCCCC1)Oc1ccc(cc1)-c1cnc2c(cnn2c1)-c1cccc2ncccc12