Reaction Details
TargetActivin receptor type-1
LigandBDBM148388
Substrate/Competitorn/a
Meas. Tech.ALK1-6 enzymatic assays
pH7.5±n/a
IC50 24±n/a nM
Commentsextracted
Citation Alimardanov, ACuny, GDGrewal, GSLee, AMcKew, JCMohedas, AHShen, MXu, XYu, PB BMP inhibitors and methods of use thereof US Patent US9682983 Publication Date 6/20/2017
 
Activin receptor type-1
Name:Activin receptor type-1
Type:n/a
Mol. Mass.:57158.32
Organism:Homo sapiens (Human)
Description:n/a
Residue:509
BDBM148388
NameBDBM148388
Synonyms:US10017516, Compound 37 | US9682983, 37
TypeSmall organic molecule
Emp. Form.C26H21N7
Mol. Mass.431.4918
SMILESN#Cc1cc(ccc1N1CCNCC1)-c1cnc2c(cnn2c1)-c1ccnc2ccccc12