Reaction Details
TargetBone morphogenetic protein receptor type-1A
LigandBDBM160009
Substrate/Competitorn/a
Meas. Tech.ALK1-6 enzymatic assays
pH7.5±n/a
IC50 1590±n/a nM
Commentsextracted
Citation Alimardanov, ACuny, GDGrewal, GSLee, AMcKew, JCMohedas, AHShen, MXu, XYu, PB BMP inhibitors and methods of use thereof US Patent US9682983 Publication Date 6/20/2017
 
Bone morphogenetic protein receptor type-1A
Name:Bone morphogenetic protein receptor type-1A
Type:Enzyme
Mol. Mass.:60204.46
Organism:Homo sapiens (Human)
Description:P36894
Residue:532
BDBM160009
NameBDBM160009
Synonyms:US10017516, Compound 38 | US9682983, 38
TypeSmall organic molecule
Emp. Form.C26H21N7
Mol. Mass.431.4918
SMILESN#Cc1cc(ccc1N1CCNCC1)-c1cnc2c(cnn2c1)-c1cccc2ncccc12