Reaction Details
TargetBone morphogenetic protein receptor type-1B
LigandBDBM161911
Substrate/Competitorn/a
Meas. Tech.ALK1-6 enzymatic assays
pH7.5±n/a
IC50 3740±n/a nM
Commentsextracted
Citation Alimardanov, ACuny, GDGrewal, GSLee, AMcKew, JCMohedas, AHShen, MXu, XYu, PB BMP inhibitors and methods of use thereof US Patent US9682983 Publication Date 6/20/2017
 
Bone morphogenetic protein receptor type-1B
Name:Bone morphogenetic protein receptor type-1B
Type:Enzyme
Mol. Mass.:56939.41
Organism:Homo sapiens (Human)
Description:O00238
Residue:502
BDBM161911
NameBDBM161911
Synonyms:US10017516, Compound 43 | US9682983, 43
TypeSmall organic molecule
Emp. Form.C27H27N7O
Mol. Mass.465.5496
SMILESCN1CCN(CCOc2ccc(cn2)-c2cnc3c(cnn3c2)-c2ccnc3ccccc23)CC1