Reaction Details
TargetActivin receptor type-1
LigandBDBM161912
Substrate/Competitorn/a
Meas. Tech.ALK1-6 enzymatic assays
pH7.5±n/a
IC50 17±n/a nM
Commentsextracted
Citation Alimardanov, ACuny, GDGrewal, GSLee, AMcKew, JCMohedas, AHShen, MXu, XYu, PB BMP inhibitors and methods of use thereof US Patent US9682983 Publication Date 6/20/2017
 
Activin receptor type-1
Name:Activin receptor type-1
Type:n/a
Mol. Mass.:57158.32
Organism:Homo sapiens (Human)
Description:n/a
Residue:509
BDBM161912
NameBDBM161912
Synonyms:US10017516, Compound 44 | US9682983, 44
TypeSmall organic molecule
Emp. Form.C27H27N7O
Mol. Mass.465.5496
SMILESCN1CCN(CCOc2ccc(cn2)-c2cnc3c(cnn3c2)-c2cccc3ncccc23)CC1