Reaction Details
TargetTGF-beta receptor type-1
LigandBDBM161920
Substrate/Competitorn/a
Meas. Tech.ALK1-6 enzymatic assays
pH7.5±n/a
IC50 330±n/a nM
Commentsextracted
Citation Alimardanov, ACuny, GDGrewal, GSLee, AMcKew, JCMohedas, AHShen, MXu, XYu, PB BMP inhibitors and methods of use thereof US Patent US9682983 Publication Date 6/20/2017
 
TGF-beta receptor type-1
Name:TGF-beta receptor type-1
Type:enzyme
Mol. Mass.:55968.24
Organism:Homo sapiens (Human)
Description:P36897
Residue:503
BDBM161920
NameBDBM161920
Synonyms:US10017516, Compound 53 US9682983, 53
TypeSmall organic molecule
Emp. Form.C27H26N6
Mol. Mass.434.5355
SMILESC[C@H]1CNC[C@@H](C)N1c1ccc(cc1)-c1cnc2c(cnn2c1)-c1cccc2ncccc12