Reaction Details
TargetSodium/glucose cotransporter 2
LigandBDBM228487
Substrate/Competitorn/a
Meas. Tech.SGLT2 Inhibition Assay
pH7.4±n/a
Temperature310.15±n/a K
IC50 0.62±n/a nM
Commentsextracted
Citation Choi, SKim, JESong, KLee, SHPark, KSeo, HJKim, MJPark, EPark, SOKong, YKang, HSon, IJung, MECha, MKim, HJLee, JSKim, MLee, MWLee, K Method for dual inhibition of SGLT1 and SGLT2 using diphenylmethane derivatives US Patent US9340521 Publication Date 5/17/2016
 
Sodium/glucose cotransporter 2
Name:Sodium/glucose cotransporter 2
Type:Protein
Mol. Mass.:72902.00
Organism:Homo sapiens (Human)
Description:P31639
Residue:672
BDBM228487
NameBDBM228487
Synonyms:US9340521, E039
TypeSmall organic molecule
Emp. Form.C25H31ClO6
Mol. Mass.462.963
SMILESCCOc1ccc(Cc2cc([C@@H]3O[C@H](CO)[C@@H](O)[C@H](O)[C@H]3O)c3CCCCc3c2Cl)cc1