Reaction Details
TargetHistone-lysine N-methyltransferase PRDM9 [195-385]
LigandBDBM228652
Substrate/Competitorn/a
Meas. Tech.Radioactivity-Based Assay
pH8.5±n/a
Temperature296.15±n/a K
Kd 4.2e+3±n/a nM
Commentsextracted
Citation Eram, MSBustos, SPLima-Fernandes, ESiarheyeva, ASenisterra, GHajian, TChau, IDuan, SWu, HDombrovski, LSchapira, MArrowsmith, CHVedadi, M Trimethylation of histone H3 lysine 36 by human methyltransferase PRDM9 protein. J Biol Chem289:12177-88 (2014) 
 
Histone-lysine N-methyltransferase PRDM9 [195-385]
Name:Histone-lysine N-methyltransferase PRDM9 [195-385]
Type:Protein
Mol. Mass.:21772.09
Organism:Homo sapiens (Human)
Description:Human PRDM9 truncation (195-385 aa)
Residue:191
BDBM228652
NameBDBM228652
Synonyms:H3 (21-44) K36me2 | LATKAARKSAPSTGGVKKPHRYRP
TypeSmall organic molecule
Emp. Form.C115H198N39O30
Mol. Mass.2607.0454
SMILESCC(C)C[C@H](N)C(=O)N[C@@H](C)C(=O)N[C@@H]([C@@H](C)O)C(=O)N[C@@H](CCCCN)C(=O)N[C@@H](C)C(=O)N[C@@H](C)C(=O)N[C@@H](CCCNC(N)=N)C(=O)N[C@@H](CCCCN)C(=O)N[C@@H](CO)C(=O)N[C@@H](C)C(=O)N1CCC[C@H]1C(=O)N[C@@H](CO)C(=O)N[C@@H]([C@@H](C)O)C(=O)NCC(=O)NCC(=O)N[C@@H](C(C)C)C(=O)N[C@@H](CCCC[NH+](C)C)C(=O)N[C@@H](CCCCN)C(=O)N1CCC[C@H]1C(=O)N[C@@H](Cc1cnc[nH]1)C(=O)N[C@@H](CCCNC(N)=N)C(=O)N[C@@H](Cc1ccc(O)cc1)C(=O)N[C@@H](CCCNC(N)=N)C(=O)N1CCC[C@H]1C(O)=O