Reaction Details
TargetTyrosine-protein kinase BTK
LigandBDBM230150
Substrate/Competitorn/a
Meas. Tech.Btk Enzyme Assay
pH7.4±n/a
Temperature298.15±n/a K
IC50 0.19±n/a nM
Commentsextracted
Citation Batt, DGBertrand, MBDelucca, GGalella, MAKo, SSLangevine, CMLiu, QShi, QSrivastava, ASTino, JAWatterson, SH Substituted tetrahydrocarbazole and carbazole carboxamide compounds US Patent US9334290 Publication Date 5/10/2016
 
Tyrosine-protein kinase BTK
Name:Tyrosine-protein kinase BTK
Type:Enzyme
Mol. Mass.:76289.95
Organism:Homo sapiens (Human)
Description:Q06187
Residue:659
BDBM230150
NameBDBM230150
Synonyms:US9334290, 31
TypeSmall organic molecule
Emp. Form.C31H24ClFN4O4
Mol. Mass.570.998
SMILESCc1c(cccc1-n1c(=O)cc2c(Cl)cccn2c1=O)-c1c(F)cc(C(N)=O)c2[nH]c3cc(ccc3c12)C(C)(C)O