Reaction Details
TargetTyrosine-protein kinase JAK2
LigandBDBM230122
Substrate/Competitorn/a
Meas. Tech.Jak2 Tyrosine Kinase Assay
pH7.4±n/a
Temperature298.15±n/a K
IC50>2000±n/a nM
Commentsextracted
Citation Batt, DGBertrand, MBDelucca, GGalella, MAKo, SSLangevine, CMLiu, QShi, QSrivastava, ASTino, JAWatterson, SH Substituted tetrahydrocarbazole and carbazole carboxamide compounds US Patent US9334290 Publication Date 5/10/2016
 
Tyrosine-protein kinase JAK2
Name:Tyrosine-protein kinase JAK2
Type:Protein
Mol. Mass.:130684.68
Organism:Homo sapiens (Human)
Description:O60674
Residue:1132
BDBM230122
NameBDBM230122
Synonyms:US10106559, Example 51 US9334290, 51 | US9850258, Example 51
TypeSmall organic molecule
Emp. Form.C31H24F2N4O4
Mol. Mass.554.5435
SMILESCc1c(cccc1-n1c(=O)[nH]c2cc(F)ccc2c1=O)-c1c(F)cc(C(N)=O)c2[nH]c3cc(ccc3c12)C(C)(C)O