Reaction Details
TargetTyrosine-protein kinase ABL1 [64-515]
LigandBDBM230795
Substrate/Competitorn/a
Meas. Tech.Radiometric Filter-Binding Assay
pH7.5±n/a
Temperature298.15±n/a K
IC50<0.1±n/a nM
Commentsextracted
Citation Furet, PGrotzfeld, RMJahnke, WJones, DBManley, PWMarzinzik, APelle, XFSalem, BSchoepfer, J Benzamide derivatives for inhibiting the activity of ABL1, ABL2 and BCR-ABL1 US Patent US9340537 Publication Date 5/17/2016
 
Tyrosine-protein kinase ABL1 [64-515]
Name:Tyrosine-protein kinase ABL1 [64-515]
Type:Enzyme Catalytic Domain
Mol. Mass.:51539.77
Organism:Homo sapiens (Human)
Description:aa 64-515
Residue:452
BDBM230795
NameBDBM230795
Synonyms:US9340537, 49 | US9896444, Example 49
TypeSmall organic molecule
Emp. Form.C21H20ClF2N5O3
Mol. Mass.463.865
SMILESCC1(O)CCN(C1)c1ncc(cc1-c1ccn[nH]1)C(=O)Nc1ccc(OC(F)(F)Cl)cc1