Reaction Details
TargetTyrosine-protein kinase ABL1 [64-515]
LigandBDBM230835
Substrate/Competitorn/a
Meas. Tech.Caliper Assay
pH7.5±n/a
Temperature303.15±n/a K
IC50 0.2±n/a nM
Commentsextracted
Citation Furet, PGrotzfeld, RMJahnke, WJones, DBManley, PWMarzinzik, APelle, XFSalem, BSchoepfer, J Benzamide derivatives for inhibiting the activity of ABL1, ABL2 and BCR-ABL1 US Patent US9340537 Publication Date 5/17/2016
 
Tyrosine-protein kinase ABL1 [64-515]
Name:Tyrosine-protein kinase ABL1 [64-515]
Type:Enzyme Catalytic Domain
Mol. Mass.:51539.77
Organism:Homo sapiens (Human)
Description:aa 64-515
Residue:452
BDBM230835
NameBDBM230835
Synonyms:US9340537, 89 | US9896444, Example 89
TypeSmall organic molecule
Emp. Form.C20H18ClF2N5O3
Mol. Mass.449.838
SMILESCc1cc([nH]n1)-c1cc(cnc1N1CC(O)C1)C(=O)Nc1ccc(OC(F)(F)Cl)cc1