Reaction Details
TargetReceptor-type tyrosine-protein phosphatase mu
LigandBDBM231167
Substrate/Competitorn/a
Meas. Tech.Enzyme Kinetic Assay
pH7±n/a
IC50>10000±n/a nM
Commentsextracted
Citation Zhang, ZZhang, S Inhibitors of protein tyrosine phosphatases US Patent US9340574 Publication Date 5/17/2016
 
Receptor-type tyrosine-protein phosphatase mu
Name:Receptor-type tyrosine-protein phosphatase mu
Type:Protein
Mol. Mass.:163683.56
Organism:Homo sapiens (Human)
Description:P28827
Residue:1452
BDBM231167
NameBDBM231167
Synonyms:US9340574, 7
TypeSmall organic molecule
Emp. Form.C42H45BrF2IN6O11P
Mol. Mass.1085.619
SMILESCOc1cc(CC(=O)NCC(NC(=O)C(CCCNC(=O)c2cccc(I)c2)NC(=O)C(Cc2ccc(cc2)C(F)(F)P(O)(O)=O)NC(=O)c2ccc(C)c(Br)c2)C(N)=O)ccc1O