Reaction Details
TargetAldo-keto reductase family 1 member C3
LigandBDBM50427627
Substrate/Competitorn/a
Meas. Tech.Inhibition Assay
IC50 0.27±n/a nM
Citation Marnett, LJLiedtke, AJPenning, TMAdeniji, AOByrns, MC Indomethacin analogs for the treatment of castrate-resistant prostate cancer US Patent US9346803 Publication Date 5/24/2016
 
Aldo-keto reductase family 1 member C3
Name:Aldo-keto reductase family 1 member C3
Type:Enzyme
Mol. Mass.:36859.86
Organism:Homo sapiens (Human)
Description:P42330
Residue:323
BDBM50427627
NameBDBM50427627
Synonyms:CHEMBL2323474 | US9346803, Table 2, Compound 9: 2-{5-methoxy-2-methyl-1-[4-(trifluoromethyl)benzoyl]-1H-indol-3-yl}acetic acid
TypeSmall organic molecule
Emp. Form.C20H16F3NO4
Mol. Mass.391.3405
SMILESCOc1ccc2n(C(=O)c3ccc(cc3)C(F)(F)F)c(C)c(CC(O)=O)c2c1