Reaction Details
TargetAldo-keto reductase family 1 member C1
LigandBDBM50427619
Substrate/Competitorn/a
Meas. Tech.Inhibition Assay
IC50 100±n/a nM
Citation Marnett, LJLiedtke, AJPenning, TMAdeniji, AOByrns, MC Indomethacin analogs for the treatment of castrate-resistant prostate cancer US Patent US9346803 Publication Date 5/24/2016
 
Aldo-keto reductase family 1 member C1
Name:Aldo-keto reductase family 1 member C1
Type:Enzyme
Mol. Mass.:36793.97
Organism:Homo sapiens (Human)
Description:Recombinant AKR1C1 enzyme was expressed in E. coli.
Residue:323
BDBM50427619
NameBDBM50427619
Synonyms:CHEMBL2323511 | US9346803, 3
TypeSmall organic molecule
Emp. Form.C21H21ClN2O5S
Mol. Mass.448.92
SMILESCOc1ccc2n(C(=O)c3ccc(Cl)cc3)c(CCC(=O)NS(C)(=O)=O)c(C)c2c1