Reaction Details
TargetAldo-keto reductase family 1 member C2
LigandBDBM50427620
Substrate/Competitorn/a
Meas. Tech.Inhibition Assay
IC50 14.50±n/a nM
Citation Marnett, LJLiedtke, AJPenning, TMAdeniji, AOByrns, MC Indomethacin analogs for the treatment of castrate-resistant prostate cancer US Patent US9346803 Publication Date 5/24/2016
 
Aldo-keto reductase family 1 member C2
Name:Aldo-keto reductase family 1 member C2
Type:Enzyme
Mol. Mass.:36739.89
Organism:Homo sapiens (Human)
Description:n/a
Residue:323
BDBM50427620
NameBDBM50427620
Synonyms:CHEMBL2323507 | US9346803, 2
TypeSmall organic molecule
Emp. Form.C20H18ClNO4
Mol. Mass.371.814
SMILESCOc1ccc2n(C(=O)c3ccc(Cl)cc3)c(CCC(O)=O)c(C)c2c1