Reaction Details
TargetAcetylcholinesterase
LigandBDBM231533
Substrate/Competitorn/a
Meas. Tech.In Vitro Pharmacodynamic Assay
IC50 154±n/a nM
Citation Bai, HZhao, XZhong, JGong, YZhu, QLiu, XZheng, XLiu, L Benzodioxole derivative and preparation method and use thereof US Patent US9346818 Publication Date 5/24/2016
 
Acetylcholinesterase
Name:Acetylcholinesterase
Type:Enzyme
Mol. Mass.:68165.65
Organism:Mus musculus (mouse)
Description:n/a
Residue:614
BDBM231533
NameBDBM231533
Synonyms:US9346818, I-18
TypeSmall organic molecule
Emp. Form.C25H27FN2O3
Mol. Mass.422.4919
SMILESFc1ccccc1CN1CCC(CCN2C(=O)c3cc4OCOc4cc3C22CC2)CC1