Reaction Details
TargetAcetylcholinesterase
LigandBDBM231551
Substrate/Competitorn/a
Meas. Tech.In Vitro Pharmacodynamic Assay
IC50 161±n/a nM
Citation Bai, HZhao, XZhong, JGong, YZhu, QLiu, XZheng, XLiu, L Benzodioxole derivative and preparation method and use thereof US Patent US9346818 Publication Date 5/24/2016
 
Acetylcholinesterase
Name:Acetylcholinesterase
Type:Enzyme
Mol. Mass.:68165.65
Organism:Mus musculus (mouse)
Description:n/a
Residue:614
BDBM231551
NameBDBM231551
Synonyms:US9346818, I-36
TypeSmall organic molecule
Emp. Form.C22H23N3O4
Mol. Mass.393.4357
SMILESO=C1N(CCC2CCN(Cc3ccccn3)CC2)C(=O)c2cc3OCOc3cc12