Reaction Details
TargetEnoyl-[acyl-carrier-protein] reductase [NADPH] FabI
LigandBDBM231620
Substrate/Competitorn/a
Meas. Tech.Inhibition Kinetics Assay
pH7.5±n/a
Ki 1.3±0.1 nM
Commentsextracted
Citation Schiebel, JChang, AShah, SLu, YLiu, LPan, PHirschbeck, MWTareilus, MEltschkner, SYu, WCummings, JEKnudson, SEBommineni, GRWalker, SGSlayden, RASotriffer, CATonge, PJKisker, C Rational design of broad spectrum antibacterial activity based on a clinically relevant enoyl-acyl carrier protein (ACP) reductase inhibitor. J Biol Chem289:15987-6005 (2014) 
 
Enoyl-[acyl-carrier-protein] reductase [NADPH] FabI
Name:Enoyl-[acyl-carrier-protein] reductase [NADPH] FabI
Type:Enzyme
Mol. Mass.:28019.03
Organism:Staphylococcus aureus
Description:Q2FZQ3
Residue:256
BDBM231620
NameBDBM231620
Synonyms:CG400549 | US10071965, Compound CG400549
TypeSmall organic molecule
Emp. Form.C19H20N2O2S
Mol. Mass.340.439
SMILESCc1c(N)cccc1Cn1ccc(OCCc2cccs2)cc1=O