Reaction Details
TargetEnoyl-[acyl-carrier-protein] reductase [NADPH] FabI
LigandBDBM190654
Substrate/Competitorn/a
Meas. Tech.Inhibition Kinetics Assay
pH7.5±n/a
Ki 2.0±0.4 nM
Commentsextracted
Citation Schiebel, JChang, AShah, SLu, YLiu, LPan, PHirschbeck, MWTareilus, MEltschkner, SYu, WCummings, JEKnudson, SEBommineni, GRWalker, SGSlayden, RASotriffer, CATonge, PJKisker, C Rational design of broad spectrum antibacterial activity based on a clinically relevant enoyl-acyl carrier protein (ACP) reductase inhibitor. J Biol Chem289:15987-6005 (2014) 
 
Enoyl-[acyl-carrier-protein] reductase [NADPH] FabI
Name:Enoyl-[acyl-carrier-protein] reductase [NADPH] FabI
Type:Enzyme
Mol. Mass.:28019.03
Organism:Staphylococcus aureus
Description:Q2FZQ3
Residue:256
BDBM190654
NameBDBM190654
Synonyms:PT173
TypeSmall organic molecule
Emp. Form.C19H26N2O
Mol. Mass.298.4225
SMILESCCCCCCc1ccn(Cc2cccc(N)c2C)c(=O)c1