Reaction Details
TargetEnoyl-[acyl-carrier-protein] reductase [NADPH] FabI
LigandBDBM190655
Substrate/Competitorn/a
Meas. Tech.Inhibition Kinetics Assay
pH7.5±n/a
Ki 19.0±2.7 nM
Commentsextracted
Citation Schiebel, JChang, AShah, SLu, YLiu, LPan, PHirschbeck, MWTareilus, MEltschkner, SYu, WCummings, JEKnudson, SEBommineni, GRWalker, SGSlayden, RASotriffer, CATonge, PJKisker, C Rational design of broad spectrum antibacterial activity based on a clinically relevant enoyl-acyl carrier protein (ACP) reductase inhibitor. J Biol Chem289:15987-6005 (2014) 
 
Enoyl-[acyl-carrier-protein] reductase [NADPH] FabI
Name:Enoyl-[acyl-carrier-protein] reductase [NADPH] FabI
Type:Enzyme
Mol. Mass.:28019.03
Organism:Staphylococcus aureus
Description:Q2FZQ3
Residue:256
BDBM190655
NameBDBM190655
Synonyms:PT179
TypeSmall organic molecule
Emp. Form.C18H23NO
Mol. Mass.269.3813
SMILESCCCCCCc1ccn(Cc2ccccc2)c(=O)c1