Reaction Details
TargetEnoyl-[acyl-carrier-protein] reductase [NADH] FabI
LigandBDBM190652
Substrate/Competitorn/a
Meas. Tech.Inhibition Kinetics Assay
pH7.5±n/a
Ki 95.7±3.8 nM
Commentsextracted
Citation Schiebel, JChang, AShah, SLu, YLiu, LPan, PHirschbeck, MWTareilus, MEltschkner, SYu, WCummings, JEKnudson, SEBommineni, GRWalker, SGSlayden, RASotriffer, CATonge, PJKisker, C Rational design of broad spectrum antibacterial activity based on a clinically relevant enoyl-acyl carrier protein (ACP) reductase inhibitor. J Biol Chem289:15987-6005 (2014) 
 
Enoyl-[acyl-carrier-protein] reductase [NADH] FabI
Name:Enoyl-[acyl-carrier-protein] reductase [NADH] FabI
Type:Enzyme
Mol. Mass.:27861.12
Organism:Escherichia coli
Description:n/a
Residue:262
BDBM190652
NameBDBM190652
Synonyms:LOX inhibitor, 13 | PT171
TypeSmall organic molecule
Emp. Form.C19H25NO
Mol. Mass.283.4079
SMILESCCCCCCc1ccn(Cc2ccccc2C)c(=O)c1