Reaction Details
TargetCathepsin D
LigandBDBM232275
Substrate/Competitorn/a
Meas. Tech.In-Vitro Fluorescence Assay
pH5.5±n/a
Temperature298.15±n/a K
IC50 4.1±n/a nM
Commentsextracted
Citation Klein, MTsaklakidis, CGuehring, HLeuthner, B Aminostatin derivatives for the treatment of arthrosis US Patent US9345742 Publication Date 5/24/2016
 
Cathepsin D
Name:Cathepsin D
Type:Enzyme
Mol. Mass.:44551.72
Organism:Homo sapiens (Human)
Description:Human proCathepsin D (SwissProt accession number P07339) was expressed in Sf9 cells, purified, and autoactivated.
Residue:412
BDBM232275
NameBDBM232275
Synonyms:US9345742, 33
TypeSmall organic molecule
Emp. Form.C41H62N6O7
Mol. Mass.750.967
SMILESCC[C@H](C)[C@H](NC(=O)C[C@H](N)[C@H](Cc1ccccc1)NC(=O)[C@@H](NC(=O)[C@H](Cc1ccccc1)NC(=O)CC(C)C)C(C)C)C(=O)N[C@@H](C(C)C)C(O)=O