Reaction Details
TargetCathepsin D
LigandBDBM232281
Substrate/Competitorn/a
Meas. Tech.In-Vitro Fluorescence Assay
pH5.5±n/a
Temperature298.15±n/a K
IC50 9.9±n/a nM
Commentsextracted
Citation Klein, MTsaklakidis, CGuehring, HLeuthner, B Aminostatin derivatives for the treatment of arthrosis US Patent US9345742 Publication Date 5/24/2016
 
Cathepsin D
Name:Cathepsin D
Type:Enzyme
Mol. Mass.:44551.72
Organism:Homo sapiens (Human)
Description:Human proCathepsin D (SwissProt accession number P07339) was expressed in Sf9 cells, purified, and autoactivated.
Residue:412
BDBM232281
NameBDBM232281
Synonyms:US9345742, 39
TypeSmall organic molecule
Emp. Form.C38H66N6O5
Mol. Mass.686.9678
SMILESCC[C@H](C)[C@H](NC(=O)C[C@H](N)[C@H](Cc1ccccc1)NC(=O)[C@@H](NC(=O)[C@H](CC(C)C)NC(=O)CC(C)C)C(C)C)C(=O)NC(CC)CC