Reaction Details
TargetSucrase-isomaltase, intestinal
LigandBDBM233001
Substrate/Competitorn/a
Meas. Tech.In Vitro α-Glucosidase Inhibitory Assay
pH6.8±n/a
IC50 9.94e+4±n/a nM
Commentsextracted
Citation Kumar, JATiwari, AKAli, AZMadhusudhana, KReddy, BSRamakrishna, SChina Raju, B New antihyperglycemic, alpha-glucosidase inhibitory, and cytotoxic derivatives of benzimidazoles. J Enzyme Inhib Med Chem25:80-6 (2010) 
 
Sucrase-isomaltase, intestinal
Name:Sucrase-isomaltase, intestinal
Type:Enzyme
Mol. Mass.:210329.04
Organism:Rattus norvegicus (Rat)
Description:P23739
Residue:1841
BDBM233001
NameBDBM233001
Synonyms:6-Nitro-2-(4-pyridyl)-1H-benzo[d]imidazole (3e)
TypeSmall organic molecule
Emp. Form.C12H8N4O2
Mol. Mass.240.2175
SMILES[O-][N+](=O)c1ccc2nc([nH]c2c1)-c1ccncc1