Reaction Details
TargetPolyphenol oxidase 1
LigandBDBM233016
Substrate/Competitorn/a
Meas. Tech.MT Kinetic Assay
pH6.8±0
Temperature300.15±0 K
Ki 6.4e+2± 2.3e+2 nM
Citation Amin, ESaboury, AAMansuri-Torshizi, HMoosavi-Movahedi, AA Potent inhibitory effects of benzyl and p-xylidine-bis dithiocarbamate sodium salts on activities of mushroom tyrosinase. J Enzyme Inhib Med Chem25:272-81 (2010) 
 
Polyphenol oxidase 1
Name:Polyphenol oxidase 1
Type:Enzyme
Mol. Mass.:63902.83
Organism:Agaricus bisporus (White button mushroom)
Description:Q00024
Residue:568
BDBM233016
NameBDBM233016
Synonyms:p-Xylidine-bis(dithiocarbamate) sodium salt (II)
TypeSmall organic molecule
Emp. Form.C10H10N2S4
Mol. Mass.286.461
SMILES[S-]C(=S)NCc1ccc(CNC([S-])=S)cc1