Reaction Details
TargetPlasminogen
LigandBDBM45440
Substrate/CompetitorBDBM233014
Meas. Tech.Antiamidolytic Assay
IC50<1.0e+4±n/a nM
Citation Drozdowska, DBruzgo, IMidura-Nowaczek, K Carbocyclic potential DNA minor groove binders and their biological evaluation. J Enzyme Inhib Med Chem25:629-34 (2010) 
 
Plasminogen
Name:Plasminogen
Type:Enzyme
Mol. Mass.:90579.18
Organism:Homo sapiens (Human)
Description:n/a
Residue:810
BDBM45440
BDBM233014
NameBDBM45440
Synonyms:4-[5-(4-amidinophenoxy)pentoxy]benzamidine;2-hydroxyethanesulfonic acid 4-[5-(4-carbamimidoylphenoxy)pentoxy]benzenecarboximidamide;2-oxidanylethanesulfonic acid MLS000028738 PENTAMIDINE ISETHIONATE cid_359323
TypeSmall organic molecule
Emp. Form.C19H24N4O2
Mol. Mass.340.4195
SMILESNC(=N)c1ccc(OCCCCCOc2ccc(cc2)C(N)=N)cc1