Reaction Details
TargetNeutrophil elastase
LigandBDBM234270
Substrate/Competitorn/a
Meas. Tech.Enzyme Kinetic Assay
Temperature298.15±0 K
Ki 0.63±0.09 nM
Citation Mulchande, JSimões, SIGaspar, MMEleutério, CVOliveira, RCruz, MEMoreira, RIley, J Synthesis, stability, biochemical and pharmacokinetic properties of a new potent and selective 4-oxo-ß-lactam inhibitor of human leukocyte elastase. J Enzyme Inhib Med Chem26:169-75 (2011) 
 
Neutrophil elastase
Name:Neutrophil elastase
Type:Enzyme
Mol. Mass.:28532.38
Organism:Homo sapiens (Human)
Description:P08246
Residue:267
BDBM234270
NameBDBM234270
Synonyms:4-oxo-β-lactam (3)
TypeSmall organic molecule
Emp. Form.C20H21NO4S
Mol. Mass.371.45
SMILESCCC1(CC)C(=O)N(C1=O)c1ccc(CS(=O)(=O)c2ccccc2)cc1