Reaction Details
TargetUDP-glucuronosyltransferase 1A1
LigandBDBM21363
Substrate/Competitorβ-estradiol
Meas. Tech.UDP-glucuronosyltransferase Activity Assay
IC50 2.6e+4± 5e+3 nM
Citation Liu, YShe, MWu, ZDai, R The inhibition study of human UDP-glucuronosyltransferases with cytochrome P450 selective substrates and inhibitors. J Enzyme Inhib Med Chem26:386-93 (2011) 
 
UDP-glucuronosyltransferase 1A1
Name:UDP-glucuronosyltransferase 1A1
Type:Enzyme
Mol. Mass.:59604.34
Organism:Homo sapiens (Human)
Description:P22309
Residue:533
BDBM21363
β-estradiol
NameBDBM21363
Synonyms:12-chloro-9-(2-fluorophenyl)-3-methyl-2,4,8-triazatricyclo[8.4.0.0^{2,6}]tetradeca-1(10),3,5,8,11,13-hexaene CHEMBL655 Midazolam US20230416258, Compound Midazolam
TypeSmall organic molecule
Emp. Form.C18H13ClFN3
Mol. Mass.325.767
SMILESCc1ncc2CN=C(c3ccccc3F)c3cc(Cl)ccc3-n12