Reaction Details
TargetUDP-glucuronosyltransferase 1A4
LigandBDBM13066
Substrate/CompetitorMidazolam
Meas. Tech.UDP-glucuronosyltransferase Activity Assay
IC50 1.92e+5± 7.8e+4 nM
Citation Liu, YShe, MWu, ZDai, R The inhibition study of human UDP-glucuronosyltransferases with cytochrome P450 selective substrates and inhibitors. J Enzyme Inhib Med Chem26:386-93 (2011) 
 
UDP-glucuronosyltransferase 1A4
Name:UDP-glucuronosyltransferase 1A4
Type:Enzyme
Mol. Mass.:60042.50
Organism:Homo sapiens (Human)
Description:P22310
Residue:534
BDBM13066
Midazolam
NameBDBM13066
Synonyms:2-{2-[(2,6-dichlorophenyl)amino]phenyl}acetic acid Diclofenac US11478464, Compound Diclofenac {2-[(2,6-dichlorophenyl)amino]phenyl}acetic acid
TypeSmall organic molecule
Emp. Form.C14H11Cl2NO2
Mol. Mass.296.149
SMILESOC(=O)Cc1ccccc1Nc1c(Cl)cccc1Cl