Reaction Details
TargetUDP-glucuronosyltransferase 2B7
LigandBDBM8885
Substrate/CompetitorDiclofenac
Meas. Tech.UDP-glucuronosyltransferase Activity Assay
IC50 1.65e+5± 1.0e+4 nM
Citation Liu, YShe, MWu, ZDai, R The inhibition study of human UDP-glucuronosyltransferases with cytochrome P450 selective substrates and inhibitors. J Enzyme Inhib Med Chem26:386-93 (2011) 
 
UDP-glucuronosyltransferase 2B7
Name:UDP-glucuronosyltransferase 2B7
Type:Enzyme
Mol. Mass.:60705.98
Organism:Homo sapiens (Human)
Description:P16662
Residue:529
BDBM8885
Diclofenac
NameBDBM8885
Synonyms:(1S,2R,10R,11S,14S,15S)-14-hydroxy-2,15-dimethyltetracyclo[8.7.0.0^{2,7}.0^{11,15}]heptadec-6-en-5-one Testosterone US9682960, Testosterone
TypeSteroid
Emp. Form.C19H28O2
Mol. Mass.288.4244
SMILES[H][C@@]12CC[C@H](O)[C@@]1(C)CC[C@@]1([H])[C@@]2([H])CCC2=CC(=O)CC[C@]12C