Reaction Details
TargetUDP-glucuronosyltransferase 2B10
LigandBDBM213826
Substrate/CompetitorDiclofenac
Meas. Tech.UDP-glucuronosyltransferase Activity Assay
IC50 6.2e+4± 1.8e+4 nM
Citation Liu, YShe, MWu, ZDai, R The inhibition study of human UDP-glucuronosyltransferases with cytochrome P450 selective substrates and inhibitors. J Enzyme Inhib Med Chem26:386-93 (2011) 
 
UDP-glucuronosyltransferase 2B10
Name:UDP-glucuronosyltransferase 2B10
Type:Enzyme
Mol. Mass.:60792.40
Organism:Homo sapiens (Human)
Description:P36537
Residue:528
BDBM213826
Diclofenac
NameBDBM213826
Synonyms:Dextromethorphan | US11535596, Compound Dextromethorphan (DM)
TypeSmall organic molecule
Emp. Form.C18H25NO
Mol. Mass.271.3972
SMILESCOc1ccc2C[C@@H]3[C@H]4CCCC[C@]4(CCN3C)c2c1