Reaction Details
TargetUDP-glucuronosyltransferase 2B10
LigandBDBM21363
Substrate/CompetitorDiclofenac
Meas. Tech.UDP-glucuronosyltransferase Activity Assay
IC50 1.06e+5± 6e+3 nM
Citation Liu, YShe, MWu, ZDai, R The inhibition study of human UDP-glucuronosyltransferases with cytochrome P450 selective substrates and inhibitors. J Enzyme Inhib Med Chem26:386-93 (2011) 
 
UDP-glucuronosyltransferase 2B10
Name:UDP-glucuronosyltransferase 2B10
Type:Enzyme
Mol. Mass.:60792.40
Organism:Homo sapiens (Human)
Description:P36537
Residue:528
BDBM21363
Diclofenac
NameBDBM21363
Synonyms:12-chloro-9-(2-fluorophenyl)-3-methyl-2,4,8-triazatricyclo[8.4.0.0^{2,6}]tetradeca-1(10),3,5,8,11,13-hexaene CHEMBL655 Midazolam US20230416258, Compound Midazolam
TypeSmall organic molecule
Emp. Form.C18H13ClFN3
Mol. Mass.325.767
SMILESCc1ncc2CN=C(c3ccccc3F)c3cc(Cl)ccc3-n12